Reaction Details
TargetCannabinoid receptor 2
LigandBDBM50324663
Substrate/Competitorn/a
Meas. Tech.ChEMBL_649740 (CHEMBL1219438)
Ki 2.4±n/a nM
Citation Pasquini, SLigresti, AMugnaini, CSemeraro, TCicione, LDe Rosa, MGuida, FLuongo, LDe Chiaro, MCascio, MGBolognini, DMarini, PPertwee, RMaione, SDi Marzo, VCorelli, F Investigations on the 4-quinolone-3-carboxylic acid motif. 3. Synthesis, structure-affinity relationships, and pharmacological characterization of 6-substituted 4-quinolone-3-carboxamides as highly selective cannabinoid-2 receptor ligands. J Med Chem53:5915-28 (2010) 
 
Cannabinoid receptor 2
Name:Cannabinoid receptor 2
Type:G Protein-Coupled Receptor (GPCR)
Mol. Mass.:39690.94
Organism:Homo sapiens (Human)
Description:P34972
Residue:360
BDBM50324663
NameBDBM50324663
Synonyms:6-(furan-2-yl)-4-oxo-1-pentyl-N-((1R,2R,4S)-1,3,3-trimethylbicyclo[2.2.1]heptan-2-yl)-1,4-dihydroquinoline-3-carboxamide | CHEMBL1216001
TypeSmall organic molecule
Emp. Form.C29H36N2O3
Mol. Mass.460.6077
SMILESCCCCCn1cc(C(=O)N[C@@H]2[C@]3(C)CC[C@@H](C3)C2(C)C)c(=O)c2cc(ccc12)-c1ccco1