Reaction Details
TargetSegment polarity protein dishevelled homolog DVL-2
LigandBDBM50378801
Substrate/Competitorn/a
Meas. Tech.ChEMBL_651099 (CHEMBL1227540)
Ki 4600±n/a nM
Citation Zhang, YAppleton, BAWiesmann, CLau, TCosta, MHannoush, RNSidhu, SS Inhibition of Wnt signaling by Dishevelled PDZ peptides. Nat Chem Biol5:217-9 (2009) 
 
Segment polarity protein dishevelled homolog DVL-2
Name:Segment polarity protein dishevelled homolog DVL-2
Type:PROTEIN
Mol. Mass.:78940.00
Organism:Homo sapiens (Human)
Description:ChEMBL_651099
Residue:736
BDBM50378801
NameBDBM50378801
Synonyms:CHEMBL1222069
TypeSmall organic molecule
Emp. Form.C48H74N10O15
Mol. Mass.1031.1592
SMILESCC[C@H](C)[C@H](NC(=O)[C@H](CC(O)=O)NC(=O)[C@H](CO)NC(=O)[C@H](Cc1c[nH]c2ccccc12)NC(=O)[C@H](CC(C)C)NC(=O)[C@@H](NC(=O)[C@@H](NC(=O)[C@H](CCC(O)=O)NC(=O)CN)[C@@H](C)CC)C(C)C)C(O)=O