Reaction Details
TargetCarbonic anhydrase 3
LigandBDBM23416
Substrate/Competitorn/a
Meas. Tech.ChEMBL_651945 (CHEMBL1227475)
Ki 3580±n/a nM
Citation Innocenti, AGülçin, IScozzafava, ASupuran, CT Carbonic anhydrase inhibitors. Antioxidant polyphenols effectively inhibit mammalian isoforms I-XV. Bioorg Med Chem Lett20:5050-3 (2010) 
 
Carbonic anhydrase 3
Name:Carbonic anhydrase 3
Type:Enzyme
Mol. Mass.:29562.11
Organism:Homo sapiens (Human)
Description:Human cloned isozyme.
Residue:260
BDBM23416
NameBDBM23416
Synonyms:α-CA inhibitor, 3 (2R,3S)-2-(3,4-dihydroxyphenyl)-3,4-dihydro-2H-1-benzopyran-3,5,7-triol Catechin | D-Catechin
TypeFlavonol
Emp. Form.C15H14O6
Mol. Mass.290.2681
SMILESO[C@H]1Cc2c(O)cc(O)cc2O[C@@H]1c1ccc(O)c(O)c1