Reaction Details
TargetCarbonic anhydrase 5B, mitochondrial
LigandBDBM50146462
Substrate/Competitorn/a
Meas. Tech.ChEMBL_651948 (CHEMBL1227478)
Ki 578000±n/a nM
Citation Innocenti, AGülçin, IScozzafava, ASupuran, CT Carbonic anhydrase inhibitors. Antioxidant polyphenols effectively inhibit mammalian isoforms I-XV. Bioorg Med Chem Lett20:5050-3 (2010) 
 
Carbonic anhydrase 5B, mitochondrial
Name:Carbonic anhydrase 5B, mitochondrial
Type:Enzyme
Mol. Mass.:36440.83
Organism:Homo sapiens (Human)
Description:Human (cloned) isozyme
Residue:317
BDBM50146462
NameBDBM50146462
Synonyms:(2E)-3-(2-hydroxyphenyl)-2-propenoic acid (2E)-3-(2-hydroxyphenyl)prop-2-enoic acid (7) (E)-3-(2-hydroxyphenyl)-2-propenoic acid CHEMBL52564 o-hydroxy-trans-cinnamic acid trans-o-hydroxycinnamic acid
TypeSmall organic molecule
Emp. Form.C9H8O3
Mol. Mass.164.158
SMILESOC(=O)\C=C\c1ccccc1O