Reaction Details
TargetCarbonic anhydrase 12
LigandBDBM50325274
Substrate/Competitorn/a
Meas. Tech.ChEMBL_651952 (CHEMBL1227625)
Ki 4350±n/a nM
Citation Innocenti, AGülçin, IScozzafava, ASupuran, CT Carbonic anhydrase inhibitors. Antioxidant polyphenols effectively inhibit mammalian isoforms I-XV. Bioorg Med Chem Lett20:5050-3 (2010) 
 
Carbonic anhydrase 12
Name:Carbonic anhydrase 12
Type:Enzyme
Mol. Mass.:39456.00
Organism:Homo sapiens (Human)
Description:Catalytic domain of human cloned isozyme was used in the assay
Residue:354
BDBM50325274
NameBDBM50325274
Synonyms:4-{2-[3-(4-Hydroxy-phenyl)-1-methyl-propylamino]-ethyl}-benzene-1,2-diol CHEMBL926 Dobutrex | cid_36811
TypeSmall organic molecule
Emp. Form.C18H23NO3
Mol. Mass.301.3801
SMILESCC(CCc1ccc(O)cc1)NCCc1ccc(O)c(O)c1