Reaction Details
TargetCarbonic anhydrase 13
LigandBDBM50146462
Substrate/Competitorn/a
Meas. Tech.ChEMBL_651953 (CHEMBL1227626)
Ki>1000000±n/a nM
Citation Innocenti, AGülçin, IScozzafava, ASupuran, CT Carbonic anhydrase inhibitors. Antioxidant polyphenols effectively inhibit mammalian isoforms I-XV. Bioorg Med Chem Lett20:5050-3 (2010) 
 
Carbonic anhydrase 13
Name:Carbonic anhydrase 13
Type:Enzyme
Mol. Mass.:29445.78
Organism:Homo sapiens (Human)
Description:Q8N1Q1
Residue:262
BDBM50146462
NameBDBM50146462
Synonyms:(2E)-3-(2-hydroxyphenyl)-2-propenoic acid (2E)-3-(2-hydroxyphenyl)prop-2-enoic acid (7) (E)-3-(2-hydroxyphenyl)-2-propenoic acid CHEMBL52564 o-hydroxy-trans-cinnamic acid trans-o-hydroxycinnamic acid
TypeSmall organic molecule
Emp. Form.C9H8O3
Mol. Mass.164.158
SMILESOC(=O)\C=C\c1ccccc1O