Reaction Details
TargetTyrosine-protein kinase ABL1
LigandBDBM50378810
Substrate/Competitorn/a
Meas. Tech.ChEMBL_652025 (CHEMBL1227835)
Ki 20±n/a nM
Citation Kraus, GAGupta, VMokhtarian, MMehanovic, SNilsen-Hamilton, M New effective inhibitors of the Abelson kinase. Bioorg Med Chem18:6316-21 (2010) 
 
Tyrosine-protein kinase ABL1
Name:Tyrosine-protein kinase ABL1
Type:Enzyme
Mol. Mass.:122897.30
Organism:Homo sapiens (Human)
Description:P00519
Residue:1130
BDBM50378810
NameBDBM50378810
Synonyms:CHEMBL1223482
TypeSmall organic molecule
Emp. Form.C23H20Cl2N6O2
Mol. Mass.483.35
SMILESCn1c2nc(NCc3cccc(NC(=O)CN)c3)ncc2cc(-c2c(Cl)cccc2Cl)c1=O