Reaction Details
TargetSodium-dependent noradrenaline transporter
LigandBDBM50325936
Substrate/Competitorn/a
Meas. Tech.ChEMBL_654118 (CHEMBL1228924)
IC50 14.7±n/a nM
Citation Lee, KHPark, CEMin, KHShin, YJChung, CMKim, HHYoon, HJWon-Kim, naRyu, EJShin, YJNam, HSCho, JWLee, HY Synthesis and pharmacological evaluation of 3-aryl-3-azolylpropan-1-amines as selective triple serotonin/norepinephrine/dopamine reuptake inhibitors. Bioorg Med Chem Lett20:5567-71 (2010) 
 
Sodium-dependent noradrenaline transporter
Name:Sodium-dependent noradrenaline transporter
Type:Multi-pass membrane protein
Mol. Mass.:69337.72
Organism:Homo sapiens (Human)
Description:P23975
Residue:617
BDBM50325936
NameBDBM50325936
Synonyms:(S)-3-(5-(2H-1,2,3-triazol-2-yl)-2H-tetrazol-2-yl)-3-(3,4-dichlorophenyl)-N-methylpropan-1-amine | CHEMBL1224383
TypeSmall organic molecule
Emp. Form.C13H14Cl2N8
Mol. Mass.353.21
SMILESCNCC[C@@H](c1ccc(Cl)c(Cl)c1)n1nnc(n1)-n1nccn1