Reaction Details
TargetSodium-dependent serotonin transporter
LigandBDBM50325937
Substrate/Competitorn/a
Meas. Tech.ChEMBL_654117 (CHEMBL1228923)
IC50 32±n/a nM
Citation Lee, KHPark, CEMin, KHShin, YJChung, CMKim, HHYoon, HJWon-Kim, naRyu, EJShin, YJNam, HSCho, JWLee, HY Synthesis and pharmacological evaluation of 3-aryl-3-azolylpropan-1-amines as selective triple serotonin/norepinephrine/dopamine reuptake inhibitors. Bioorg Med Chem Lett20:5567-71 (2010) 
 
Sodium-dependent serotonin transporter
Name:Sodium-dependent serotonin transporter
Type:Multi-pass membrane protein
Mol. Mass.:70322.51
Organism:Homo sapiens (Human)
Description:P31645
Residue:630
BDBM50325937
NameBDBM50325937
Synonyms:CHEMBL1224227 | rac-N-methyl-3-(naphthalen-2-yl)-3-(2H-tetrazol-2-yl)propan-1-amine
TypeSmall organic molecule
Emp. Form.C15H17N5
Mol. Mass.267.329
SMILESCNCCC(c1ccc2ccccc2c1)n1ncnn1