Reaction Details
TargetSodium-dependent noradrenaline transporter
LigandBDBM50325937
Substrate/Competitorn/a
Meas. Tech.ChEMBL_654118 (CHEMBL1228924)
IC50 13.3±n/a nM
Citation Lee, KHPark, CEMin, KHShin, YJChung, CMKim, HHYoon, HJWon-Kim, naRyu, EJShin, YJNam, HSCho, JWLee, HY Synthesis and pharmacological evaluation of 3-aryl-3-azolylpropan-1-amines as selective triple serotonin/norepinephrine/dopamine reuptake inhibitors. Bioorg Med Chem Lett20:5567-71 (2010) 
 
Sodium-dependent noradrenaline transporter
Name:Sodium-dependent noradrenaline transporter
Type:Multi-pass membrane protein
Mol. Mass.:69337.72
Organism:Homo sapiens (Human)
Description:P23975
Residue:617
BDBM50325937
NameBDBM50325937
Synonyms:CHEMBL1224227 | rac-N-methyl-3-(naphthalen-2-yl)-3-(2H-tetrazol-2-yl)propan-1-amine
TypeSmall organic molecule
Emp. Form.C15H17N5
Mol. Mass.267.329
SMILESCNCCC(c1ccc2ccccc2c1)n1ncnn1