Reaction Details
TargetRAC-alpha serine/threonine-protein kinase
LigandBDBM15152
Substrate/Competitorn/a
Meas. Tech.ChEMBL_660422 (CHEMBL1250012)
Ki 760±n/a nM
Citation Knight, ZAShokat, KM Features of selective kinase inhibitors. Chem Biol12:621-37 (2005) 
 
RAC-alpha serine/threonine-protein kinase
Name:RAC-alpha serine/threonine-protein kinase
Type:Enzyme
Mol. Mass.:55681.25
Organism:Homo sapiens (Human)
Description:P31749
Residue:480
BDBM15152
NameBDBM15152
Synonyms:1-(1-{[4-(6-methyl-5-oxo-3-phenyl-4,5-dihydropyrazin-2-yl)phenyl]methyl}piperidin-4-yl)-2,3-dihydro-1H-1,3-benzodiazol-2-one | pyrazinone 13b
TypeSmall organic molecule
Emp. Form.C30H29N5O2
Mol. Mass.491.5836
SMILESCc1nc(-c2ccc(CN3CCC(CC3)n3c4ccccc4[nH]c3=O)cc2)c([nH]c1=O)-c1ccccc1