Reaction Details
TargetTyrosine-protein kinase SYK
LigandBDBM50325991
Substrate/Competitorn/a
Meas. Tech.ChEMBL_660400 (CHEMBL1249990)
Ki 7.5±n/a nM
Citation Knight, ZAShokat, KM Features of selective kinase inhibitors. Chem Biol12:621-37 (2005) 
 
Tyrosine-protein kinase SYK
Name:Tyrosine-protein kinase SYK
Type:Enzyme
Mol. Mass.:72079.99
Organism:Homo sapiens (Human)
Description:P43405
Residue:635
BDBM50325991
NameBDBM50325991
Synonyms:2-(7-(3,4-dimethoxyphenyl)imidazo[1,2-c]pyrimidin-5-ylamino)nicotinamide hydrochloride CHEMBL1242100 | CHEMBL541400
TypeSmall organic molecule
Emp. Form.C20H18N6O3
Mol. Mass.390.3953
SMILESCOc1ccc(cc1OC)-c1cc2nccn2c(Nc2ncccc2C(N)=O)n1