Reaction Details
TargetNischarin
LigandBDBM50326219
Substrate/Competitorn/a
Meas. Tech.ChEMBL_659594 (CHEMBL1248889)
Ki<1000±n/a nM
Citation Sams, AGHentzer, MMikkelsen, GKLarsen, KBundgaard, CPlath, NChristoffersen, CTBang-Andersen, B Discovery of N-{1-[3-(3-oxo-2,3-dihydrobenzo[1,4]oxazin-4-yl)propyl]piperidin-4-yl}-2-phenylacetamide (Lu AE51090): an allosteric muscarinic M1 receptor agonist with unprecedented selectivity and procognitive potential. J Med Chem53:6386-97 (2010) 
 
Nischarin
Name:Nischarin
Type:Enzyme
Mol. Mass.:166571.31
Organism:Homo sapiens (Human)
Description:Q9Y2I1
Residue:1504
BDBM50326219
NameBDBM50326219
Synonyms:4-(4-butylpiperidin-1-yl)-1-o-tolylbutan-1-one CHEMBL2206334
TypeSmall organic molecule
Emp. Form.C20H31NO
Mol. Mass.301.4662
SMILESCCCCC1CCN(CCCC(=O)c2ccccc2C)CC1