Reaction Details
TargetMuscarinic acetylcholine receptor M1
LigandBDBM50326241
Substrate/Competitorn/a
Meas. Tech.ChEMBL_659441 (CHEMBL1248351)
EC50 1100±n/a nM
Citation Sams, AGHentzer, MMikkelsen, GKLarsen, KBundgaard, CPlath, NChristoffersen, CTBang-Andersen, B Discovery of N-{1-[3-(3-oxo-2,3-dihydrobenzo[1,4]oxazin-4-yl)propyl]piperidin-4-yl}-2-phenylacetamide (Lu AE51090): an allosteric muscarinic M1 receptor agonist with unprecedented selectivity and procognitive potential. J Med Chem53:6386-97 (2010) 
 
Muscarinic acetylcholine receptor M1
Name:Muscarinic acetylcholine receptor M1
Type:Protein
Mol. Mass.:51442.54
Organism:Homo sapiens (Human)
Description:P11229
Residue:460
BDBM50326241
NameBDBM50326241
Synonyms:CHEMBL1243139 | N-(1-(3-(2-oxobenzo[d]oxazol-3(2H)-yl)propyl)piperidin-4-yl)-2-phenylacetamide
TypeSmall organic molecule
Emp. Form.C23H27N3O3
Mol. Mass.393.4788
SMILESO=C(Cc1ccccc1)NC1CCN(CCCn2c3ccccc3oc2=O)CC1