Reaction Details
TargetCyclin-dependent kinase 1
LigandBDBM5718
Substrate/Competitorn/a
Meas. Tech.ChEMBL_660572 (CHEMBL1250280)
IC50 7000±n/a nM
Citation Sridhar, JAkula, NPattabiraman, N Selectivity and potency of cyclin-dependent kinase inhibitors. AAPS J8:204-21 (2006) 
 
Cyclin-dependent kinase 1
Name:Cyclin-dependent kinase 1
Type:Enzyme Subunit
Mol. Mass.:34101.08
Organism:Homo sapiens (Human)
Description:P06493
Residue:297
BDBM5718
NameBDBM5718
Synonyms:2,6,9-Trisubstituted purine deriv. 26 2-{[6-(benzylamino)-9-methyl-9H-purin-2-yl]amino}ethanol CHEMBL280074 purine deriv. 5
TypeSmall organic molecule
Emp. Form.C15H18N6O
Mol. Mass.298.343
SMILESCn1cnc2c(NCc3ccccc3)nc(NCCO)nc12