Reaction Details
TargetCyclin-dependent kinase 1
LigandBDBM7238
Substrate/Competitorn/a
Meas. Tech.ChEMBL_660572 (CHEMBL1250280)
IC50 55±n/a nM
Citation Sridhar, JAkula, NPattabiraman, N Selectivity and potency of cyclin-dependent kinase inhibitors. AAPS J8:204-21 (2006) 
 
Cyclin-dependent kinase 1
Name:Cyclin-dependent kinase 1
Type:Enzyme Subunit
Mol. Mass.:34101.08
Organism:Homo sapiens (Human)
Description:P06493
Residue:297
BDBM7238
NameBDBM7238
Synonyms:(3Z)-3-(1H-imidazol-5-ylmethylidene)-5-methoxy-2,3-dihydro-1H-indol-2-one SU9516 imidazole indolinone driv.
TypeSmall organic molecule
Emp. Form.C13H11N3O2
Mol. Mass.241.2453
SMILESCOc1ccc2NC(=O)C(=Cc3cnc[nH]3)c2c1