Reaction Details
TargetCyclin-dependent kinase 2
LigandBDBM50378820
Substrate/Competitorn/a
Meas. Tech.ChEMBL_660573 (CHEMBL1250281)
IC50 6±n/a nM
Citation Sridhar, JAkula, NPattabiraman, N Selectivity and potency of cyclin-dependent kinase inhibitors. AAPS J8:204-21 (2006) 
 
Cyclin-dependent kinase 2
Name:Cyclin-dependent kinase 2
Type:Enzyme Subunit
Mol. Mass.:33938.17
Organism:Homo sapiens (Human)
Description:P24941
Residue:298
BDBM50378820
NameBDBM50378820
Synonyms:CHEMBL1241567
TypeSmall organic molecule
Emp. Form.C19H18F2N2O2
Mol. Mass.344.3552
SMILESCCCCOc1c(ccc2[nH]ncc12)C(=O)c1c(F)cc(C)cc1F