Reaction Details
TargetCyclin-dependent kinase 2
LigandBDBM50378823
Substrate/Competitorn/a
Meas. Tech.ChEMBL_660573 (CHEMBL1250281)
IC50 5±n/a nM
Citation Sridhar, JAkula, NPattabiraman, N Selectivity and potency of cyclin-dependent kinase inhibitors. AAPS J8:204-21 (2006) 
 
Cyclin-dependent kinase 2
Name:Cyclin-dependent kinase 2
Type:Enzyme Subunit
Mol. Mass.:33938.17
Organism:Homo sapiens (Human)
Description:P24941
Residue:298
BDBM50378823
NameBDBM50378823
Synonyms:CHEMBL1241849
TypeSmall organic molecule
Emp. Form.C23H25N5O2S
Mol. Mass.435.542
SMILESCN(C)CCNS(=O)(=O)c1ccc(Nc2cccc(c2)-c2cnc3ccccn23)cc1