Reaction Details
TargetCyclin-dependent kinase 2
LigandBDBM50164693
Substrate/Competitorn/a
Meas. Tech.ChEMBL_660573 (CHEMBL1250281)
IC50 2±n/a nM
Citation Sridhar, JAkula, NPattabiraman, N Selectivity and potency of cyclin-dependent kinase inhibitors. AAPS J8:204-21 (2006) 
 
Cyclin-dependent kinase 2
Name:Cyclin-dependent kinase 2
Type:Enzyme Subunit
Mol. Mass.:33938.17
Organism:Homo sapiens (Human)
Description:P24941
Residue:298
BDBM50164693
NameBDBM50164693
Synonyms:CHEMBL194721 | N*2*-(3H-Benzoimidazol-5-yl)-N*4*-(2-chloro-phenyl)-5-trifluoromethyl-pyrimidine-2,4-diamine
TypeSmall organic molecule
Emp. Form.C18H12ClF3N6
Mol. Mass.404.776
SMILESFC(F)(F)c1cnc(Nc2ccc3nc[nH]c3c2)nc1Nc1ccccc1Cl