Reaction Details
TargetCyclin-dependent kinase 4
LigandBDBM50378820
Substrate/Competitorn/a
Meas. Tech.ChEMBL_660568 (CHEMBL1250276)
IC50 2700±n/a nM
Citation Sridhar, JAkula, NPattabiraman, N Selectivity and potency of cyclin-dependent kinase inhibitors. AAPS J8:204-21 (2006) 
 
Cyclin-dependent kinase 4
Name:Cyclin-dependent kinase 4
Type:Enzyme Subunit
Mol. Mass.:33731.96
Organism:Homo sapiens (Human)
Description:P11802
Residue:303
BDBM50378820
NameBDBM50378820
Synonyms:CHEMBL1241567
TypeSmall organic molecule
Emp. Form.C19H18F2N2O2
Mol. Mass.344.3552
SMILESCCCCOc1c(ccc2[nH]ncc12)C(=O)c1c(F)cc(C)cc1F