Reaction Details
TargetCyclin-dependent kinase 2
LigandBDBM5775
Substrate/Competitorn/a
Meas. Tech.ChEMBL_660573 (CHEMBL1250281)
IC50 50±n/a nM
Citation Sridhar, JAkula, NPattabiraman, N Selectivity and potency of cyclin-dependent kinase inhibitors. AAPS J8:204-21 (2006) 
 
Cyclin-dependent kinase 2
Name:Cyclin-dependent kinase 2
Type:Enzyme Subunit
Mol. Mass.:33938.17
Organism:Homo sapiens (Human)
Description:P24941
Residue:298
BDBM5775
NameBDBM5775
Synonyms:4-butoxy-5-[(2,4,6-trifluorophenyl)carbonyl]-1H-pyrazolo[3,4-b]pyridine pyrazolo[3,4-b]pyridine deriv.
TypeSmall organic molecule
Emp. Form.C17H14F3N3O2
Mol. Mass.349.3072
SMILESCCCCOc1c(cnc2[nH]ncc12)C(=O)c1c(F)cc(F)cc1F