Reaction Details
TargetGalectin-7
LigandBDBM50326580
Substrate/Competitorn/a
Meas. Tech.ChEMBL_661836 (CHEMBL1252152)
Kd 2200000±n/a nM
Citation Salameh, BACumpstey, ISundin, ALeffler, HNilsson, UJ 1H-1,2,3-triazol-1-yl thiodigalactoside derivatives as high affinity galectin-3 inhibitors. Bioorg Med Chem18:5367-78 (2010) 
 
Galectin-7
Name:Galectin-7
Type:Galactoside-binding protein
Mol. Mass.:15077.89
Organism:Homo sapiens (Human)
Description:n/a
Residue:136
BDBM50326580
NameBDBM50326580
Synonyms:CHEMBL1253738 | Methyl-3-deoxy-3-(4-propyl-1H-[1,2,3]-triazol-1-yl)-1-thio-beta-D-galactopyranoside
TypeSmall organic molecule
Emp. Form.C12H21N3O4S
Mol. Mass.303.378
SMILESCCCc1cn(nn1)[C@H]1[C@@H](O)[C@@H](CO)O[C@@H](SC)[C@@H]1O