Reaction Details
TargetGalectin-7
LigandBDBM50326585
Substrate/Competitorn/a
Meas. Tech.ChEMBL_661836 (CHEMBL1252152)
Kd 1100000±n/a nM
Citation Salameh, BACumpstey, ISundin, ALeffler, HNilsson, UJ 1H-1,2,3-triazol-1-yl thiodigalactoside derivatives as high affinity galectin-3 inhibitors. Bioorg Med Chem18:5367-78 (2010) 
 
Galectin-7
Name:Galectin-7
Type:Galactoside-binding protein
Mol. Mass.:15077.89
Organism:Homo sapiens (Human)
Description:n/a
Residue:136
BDBM50326585
NameBDBM50326585
Synonyms:CHEMBL1254932 | Methyl-3-(4-butylaminocarbonyl-1H-[1,2,3]-triazol-1-yl)-3-deoxy-1-thio-beta-D-galactopyranoside
TypeSmall organic molecule
Emp. Form.C14H24N4O5S
Mol. Mass.360.429
SMILESCCCCNC(=O)c1cn(nn1)[C@H]1[C@@H](O)[C@@H](CO)O[C@@H](SC)[C@@H]1O