Reaction Details
TargetGalectin-7
LigandBDBM50326590
Substrate/Competitorn/a
Meas. Tech.ChEMBL_661836 (CHEMBL1252152)
Kd 74000±n/a nM
Citation Salameh, BACumpstey, ISundin, ALeffler, HNilsson, UJ 1H-1,2,3-triazol-1-yl thiodigalactoside derivatives as high affinity galectin-3 inhibitors. Bioorg Med Chem18:5367-78 (2010) 
 
Galectin-7
Name:Galectin-7
Type:Galactoside-binding protein
Mol. Mass.:15077.89
Organism:Homo sapiens (Human)
Description:n/a
Residue:136
BDBM50326590
NameBDBM50326590
Synonyms:CHEMBL1253740 | methyl 3-(4-benzylamino carbonyl-1H-[1,2,3]-triazol-1-yl)-3-deoxy-beta-D-galactopyranosyl-(1->4)-2-acetamido-2-deoxy-beta-D-glucopyranoside
TypeSmall organic molecule
Emp. Form.C25H35N5O11
Mol. Mass.581.5723
SMILESCO[C@@H]1O[C@H](CO)[C@@H](O[C@@H]2O[C@H](CO)[C@H](O)[C@@H]([C@H]2O)n2cc(nn2)C(=O)NCc2ccccc2)[C@H](O)[C@H]1NC(C)=O