Reaction Details
TargetGalectin-8
LigandBDBM50326590
Substrate/Competitorn/a
Meas. Tech.ChEMBL_661837 (CHEMBL1252153)
Kd>2000000±n/a nM
Citation Salameh, BACumpstey, ISundin, ALeffler, HNilsson, UJ 1H-1,2,3-triazol-1-yl thiodigalactoside derivatives as high affinity galectin-3 inhibitors. Bioorg Med Chem18:5367-78 (2010) 
 
Galectin-8
Name:Galectin-8
Type:PROTEIN
Mol. Mass.:35814.23
Organism:Homo sapiens (Human)
Description:ChEMBL_1454625
Residue:317
BDBM50326590
NameBDBM50326590
Synonyms:CHEMBL1253740 | methyl 3-(4-benzylamino carbonyl-1H-[1,2,3]-triazol-1-yl)-3-deoxy-beta-D-galactopyranosyl-(1->4)-2-acetamido-2-deoxy-beta-D-glucopyranoside
TypeSmall organic molecule
Emp. Form.C25H35N5O11
Mol. Mass.581.5723
SMILESCO[C@@H]1O[C@H](CO)[C@@H](O[C@@H]2O[C@H](CO)[C@H](O)[C@@H]([C@H]2O)n2cc(nn2)C(=O)NCc2ccccc2)[C@H](O)[C@H]1NC(C)=O