Reaction Details
TargetMu-type opioid receptor
LigandBDBM50326681
Substrate/Competitorn/a
Meas. Tech.ChEMBL_662213 (CHEMBL1252204)
Ki 0.830000±n/a nM
Citation Pasquinucci, LPrezzavento, OMarrazzo, AAmata, ERonsisvalle, SGeorgoussi, ZFourla, DDScoto, GMParenti, CAricò, GRonsisvalle, G Evaluation of N-substitution in 6,7-benzomorphan compounds. Bioorg Med Chem18:4975-82 (2010) 
 
Mu-type opioid receptor
Name:Mu-type opioid receptor
Type:G Protein-Coupled Receptor (GPCR)
Mol. Mass.:44503.11
Organism:Rattus norvegicus (rat)
Description:Competition binding assays were carried out using membrane preparations from transfected HN9.10 cells that constitutively expressed the mu opioid receptor.
Residue:398
BDBM50326681
NameBDBM50326681
Synonyms:3-[(2R,6R,11R)-8-Hydroxy-6,11-dimethyl-1,4,5,6-tetrahydro-2,6-methano-3-benzazocin-3(2H)-yl]-N-phenylpropanamide | CHEMBL1254685
TypeSmall organic molecule
Emp. Form.C23H28N2O2
Mol. Mass.364.4806
SMILESC[C@H]1CN(CCC(=O)Nc2ccccc2)[C@@H]2Cc3ccc(O)cc3[C@]1(C)C2