Reaction Details
TargetGlucocorticoid receptor
LigandBDBM18207
Substrate/Competitorn/a
Meas. Tech.ChEMBL_663368 (CHEMBL1250864)
IC50 3.4±n/a nM
Citation Riether, DHarcken, CRazavi, HKuzmich, DGilmore, TBentzien, JPack, EJSouza, DNelson, RMKukulka, AFadra, TNZuvela-Jelaska, LPelletier, JDinallo, RPanzenbeck, MTorcellini, CNabozny, GHThomson, DS Nonsteroidal dissociated glucocorticoid agonists containing azaindoles as steroid A-ring mimetics. J Med Chem53:6681-98 (2010) 
 
Glucocorticoid receptor
Name:Glucocorticoid receptor
Type:Enzyme
Mol. Mass.:85656.87
Organism:Homo sapiens (Human)
Description:P04150
Residue:777
BDBM18207
NameBDBM18207
Synonyms:(1R,2S,10S,11S,13R,14R,15S,17S)-1-fluoro-14,17-dihydroxy-14-(2-hydroxyacetyl)-2,13,15-trimethyltetracyclo[8.7.0.0^{2,7}.0^{11,15}]heptadeca-3,6-dien-5-one US11554172, Compound Dexamethasone dexamethasone (tetramethyl-rhodamine conjugated )
TypeSteroid
Emp. Form.C22H29FO5
Mol. Mass.392.4611
SMILES[H][C@@]12C[C@@H](C)[C@](O)(C(=O)CO)[C@@]1(C)C[C@H](O)[C@@]1(F)[C@@]2([H])CCC2=CC(=O)C=C[C@]12C