Reaction Details
TargetGlucocorticoid receptor
LigandBDBM19190
Substrate/Competitorn/a
Meas. Tech.ChEMBL_663368 (CHEMBL1250864)
IC50 15±n/a nM
Citation Riether, DHarcken, CRazavi, HKuzmich, DGilmore, TBentzien, JPack, EJSouza, DNelson, RMKukulka, AFadra, TNZuvela-Jelaska, LPelletier, JDinallo, RPanzenbeck, MTorcellini, CNabozny, GHThomson, DS Nonsteroidal dissociated glucocorticoid agonists containing azaindoles as steroid A-ring mimetics. J Med Chem53:6681-98 (2010) 
 
Glucocorticoid receptor
Name:Glucocorticoid receptor
Type:Enzyme
Mol. Mass.:85656.87
Organism:Homo sapiens (Human)
Description:P04150
Residue:777
BDBM19190
NameBDBM19190
Synonyms:(1S,2R,10S,11S,14R,15S,17S)-14,17-dihydroxy-14-(2-hydroxyacetyl)-2,15-dimethyltetracyclo[8.7.0.0^{2,7}.0^{11,15}]heptadeca-3,6-dien-5-one Delta-Cortef Prednisolone | US10196374, Prednisolone
TypeSteroid
Emp. Form.C21H28O5
Mol. Mass.360.444
SMILES[H][C@@]12CC[C@](O)(C(=O)CO)[C@@]1(C)C[C@H](O)[C@@]1([H])[C@@]2([H])CCC2=CC(=O)C=C[C@]12C