Reaction Details
TargetGlucocorticoid receptor
LigandBDBM50326949
Substrate/Competitorn/a
Meas. Tech.ChEMBL_663374 (CHEMBL1250870)
EC50 30±n/a nM
Citation Riether, DHarcken, CRazavi, HKuzmich, DGilmore, TBentzien, JPack, EJSouza, DNelson, RMKukulka, AFadra, TNZuvela-Jelaska, LPelletier, JDinallo, RPanzenbeck, MTorcellini, CNabozny, GHThomson, DS Nonsteroidal dissociated glucocorticoid agonists containing azaindoles as steroid A-ring mimetics. J Med Chem53:6681-98 (2010) 
 
Glucocorticoid receptor
Name:Glucocorticoid receptor
Type:Enzyme
Mol. Mass.:85656.87
Organism:Homo sapiens (Human)
Description:P04150
Residue:777
BDBM50326949
NameBDBM50326949
Synonyms:4-(2,3-Dihydrobenzofuran-7-yl)-1,1,1-trifluoro-4-methyl-2-(1H-pyrrolo[2,3-c]pyridin-2-ylmethyl)pentan-2-ol | CHEMBL1254419
TypeSmall organic molecule
Emp. Form.C22H23F3N2O2
Mol. Mass.404.4254
SMILESCC(C)(CC(O)(Cc1cc2ccncc2[nH]1)C(F)(F)F)c1cccc2CCOc12