Reaction Details
TargetMineralocorticoid receptor
LigandBDBM50326954
Substrate/Competitorn/a
Meas. Tech.ChEMBL_663370 (CHEMBL1250866)
IC50 390±n/a nM
Citation Riether, DHarcken, CRazavi, HKuzmich, DGilmore, TBentzien, JPack, EJSouza, DNelson, RMKukulka, AFadra, TNZuvela-Jelaska, LPelletier, JDinallo, RPanzenbeck, MTorcellini, CNabozny, GHThomson, DS Nonsteroidal dissociated glucocorticoid agonists containing azaindoles as steroid A-ring mimetics. J Med Chem53:6681-98 (2010) 
 
Mineralocorticoid receptor
Name:Mineralocorticoid receptor
Type:Enzyme
Mol. Mass.:107076.42
Organism:Homo sapiens (Human)
Description:P08235
Residue:984
BDBM50326954
NameBDBM50326954
Synonyms:1,1,1-Trifluoro-4-(2-methoxy-5-pyridin-3-ylphenyl)-4-methyl-2-(1H-pyrrolo[2,3-c]pyridin-2-ylmethyl)pentan-2-ol | CHEMBL1254173
TypeSmall organic molecule
Emp. Form.C26H26F3N3O2
Mol. Mass.469.4987
SMILESCOc1ccc(cc1C(C)(C)CC(O)(Cc1cc2ccncc2[nH]1)C(F)(F)F)-c1ccncc1