Reaction Details
TargetDelta-type opioid receptor
LigandBDBM50327236
Substrate/Competitorn/a
Meas. Tech.ChEMBL_664311 (CHEMBL1259346)
Ki>10000±n/a nM
Citation Reynolds, AHanani, RHibbs, DDamont, ADa Pozzo, ESelleri, SDollé, FMartini, CKassiou, M Pyrazolo[1,5-a]pyrimidine acetamides: 4-Phenyl alkyl ether derivatives as potent ligands for the 18 kDa translocator protein (TSPO). Bioorg Med Chem Lett20:5799-802 (2010) 
 
Delta-type opioid receptor
Name:Delta-type opioid receptor
Type:G Protein-Coupled Receptor (GPCR)
Mol. Mass.:40382.98
Organism:Homo sapiens (Human)
Description:Competition binding assays were carried out using membrane preparations from transfected HN9.10 cells that constitutively expressed the delta opioid receptor.
Residue:372
BDBM50327236
NameBDBM50327236
Synonyms:2-[5,7-Dimethyl-2-(4'-propoxyphenyl)pyrazolo[1,5-a]pyrimidin-3-yl]-N,N-diethylacetamide | CHEMBL1258722
TypeSmall organic molecule
Emp. Form.C23H30N4O2
Mol. Mass.394.5099
SMILESCCCOc1ccc(cc1)-c1nn2c(C)cc(C)nc2c1CC(=O)N(CC)CC