Reaction Details
TargetTranslocator protein
LigandBDBM50327237
Substrate/Competitorn/a
Meas. Tech.ChEMBL_664273 (CHEMBL1259308)
Ki 5.7±n/a nM
Citation Reynolds, AHanani, RHibbs, DDamont, ADa Pozzo, ESelleri, SDollé, FMartini, CKassiou, M Pyrazolo[1,5-a]pyrimidine acetamides: 4-Phenyl alkyl ether derivatives as potent ligands for the 18 kDa translocator protein (TSPO). Bioorg Med Chem Lett20:5799-802 (2010) 
 
Translocator protein
Name:Translocator protein
Type:Mitochondrion membrane protein
Mol. Mass.:18945.84
Organism:Rattus norvegicus (rat)
Description:Competitive binding experiments were performed on rat kidney mitochondrial membranes.
Residue:169
BDBM50327237
NameBDBM50327237
Synonyms:2-[2-(4'-Ethoxyphenyl)-5,7-dimethylpyrazolo[1,5-a]pyrimidin-3-yl]-N,N-diethylacetamide | CHEMBL1258614
TypeSmall organic molecule
Emp. Form.C22H28N4O2
Mol. Mass.380.4833
SMILESCCOc1ccc(cc1)-c1nn2c(C)cc(C)nc2c1CC(=O)N(CC)CC