Reaction Details
TargetAcetylcholinesterase
LigandBDBM50292332
Substrate/Competitorn/a
Meas. Tech.ChEMBL_675033 (CHEMBL1272767)
IC50 400±n/a nM
Citation Tsai, SFLee, SS Characterization of Acetylcholinesterase Inhibitory Constituents from Annona glabra Assisted by HPLC Microfractionation. J Nat Prod73:1632-5 (2010) 
 
Acetylcholinesterase
Name:Acetylcholinesterase
Type:Enzyme
Mol. Mass.:71812.79
Organism:Electrophorus electricus (Electric eel)
Description:n/a
Residue:633
BDBM50292332
NameBDBM50292332
Synonyms:2,3,9,10-Tetramethoxy-5,6-dihydro-isoquino[3,2-a]isoquinolinylium; chloride CHEMBL1270849 CHEMBL274189 PALMATINE
TypeSmall organic molecule
Emp. Form.C21H22NO4
Mol. Mass.352.4031
SMILESCOc1cc2CC[n+]3cc4c(OC)c(OC)ccc4cc3-c2cc1OC