Reaction Details
TargetCoagulation factor X
LigandBDBM50328726
Substrate/Competitorn/a
Meas. Tech.ChEMBL_675275 (CHEMBL1273257)
IC50 0.16±n/a nM
Citation Pinto, DJSmallheer, JMCheney, DLKnabb, RMWexler, RR Factor Xa inhibitors: next-generation antithrombotic agents. J Med Chem53:6243-74 (2010) 
 
Coagulation factor X
Name:Coagulation factor X
Type:Enzyme
Mol. Mass.:54726.60
Organism:Homo sapiens (Human)
Description:n/a
Residue:488
BDBM50328726
NameBDBM50328726
Synonyms:(2R,4R)-N1-(4-chlorophenyl)-N2-(3-fluoro-2'-(methylsulfonyl)biphenyl-4-yl)-4-methoxypyrrolidine-1,2-dicarboxamide 4-Substituted Pyrrolidine Ring, 18 CHEMBL1229814
TypeSmall organic molecule
Emp. Form.C26H25ClFN3O5S
Mol. Mass.546.01
SMILESCO[C@@H]1C[C@@H](N(C1)C(=O)Nc1ccc(Cl)cc1)C(=O)Nc1ccc(cc1F)-c1ccccc1S(C)(=O)=O