Reaction Details
TargetCoagulation factor X
LigandBDBM50123431
Substrate/Competitorn/a
Meas. Tech.ChEMBL_675275 (CHEMBL1273257)
Ki 6±n/a nM
Citation Pinto, DJSmallheer, JMCheney, DLKnabb, RMWexler, RR Factor Xa inhibitors: next-generation antithrombotic agents. J Med Chem53:6243-74 (2010) 
 
Coagulation factor X
Name:Coagulation factor X
Type:Enzyme
Mol. Mass.:54726.60
Organism:Homo sapiens (Human)
Description:n/a
Residue:488
BDBM50123431
NameBDBM50123431
Synonyms:7-{7-[1-(1-Imino-ethyl)-piperidin-4-yloxy]-3-oxo-2,3-dihydro-benzo[1,4]oxazin-4-ylmethyl}-naphthalene-2-carboxamidine | CHEMBL153640
TypeSmall organic molecule
Emp. Form.C27H29N5O3
Mol. Mass.471.5509
SMILESCC(=N)N1CCC(CC1)Oc1ccc2N(Cc3ccc4ccc(cc4c3)C(N)=N)C(=O)COc2c1