Reaction Details
TargetCoagulation factor X
LigandBDBM12676
Substrate/Competitorn/a
Meas. Tech.ChEMBL_675275 (CHEMBL1273257)
Ki 0.19±n/a nM
Citation Pinto, DJSmallheer, JMCheney, DLKnabb, RMWexler, RR Factor Xa inhibitors: next-generation antithrombotic agents. J Med Chem53:6243-74 (2010) 
 
Coagulation factor X
Name:Coagulation factor X
Type:Enzyme
Mol. Mass.:54726.60
Organism:Homo sapiens (Human)
Description:n/a
Residue:488
BDBM12676
NameBDBM12676
Synonyms:1-(3-Aminobenzisoxazol-5-yl)-3-trifluoromethyl-N-[2-fluoro-4-[(2-dimethylaminomethyl)imidazol-1-yl]phenyl]-1H-pyrazole-5-carboxyamide Hydrochloride Salt BMS-561389 CHEMBL558198 Razaxaban
TypeSmall organic molecule
Emp. Form.C24H20F4N8O2
Mol. Mass.528.4616
SMILESCN(C)Cc1nccn1-c1ccc(NC(=O)c2cc(nn2-c2ccc3onc(N)c3c2)C(F)(F)F)c(F)c1