Reaction Details
TargetAntithrombin-III
LigandBDBM50378854
Substrate/Competitorn/a
Meas. Tech.ChEMBL_675276 (CHEMBL1273258)
Kd 1±n/a nM
Citation Pinto, DJSmallheer, JMCheney, DLKnabb, RMWexler, RR Factor Xa inhibitors: next-generation antithrombotic agents. J Med Chem53:6243-74 (2010) 
 
Antithrombin-III
Name:Antithrombin-III
Type:PROTEIN
Mol. Mass.:52602.34
Organism:Homo sapiens (Human)
Description:ChEMBL_35871
Residue:464
BDBM50378854
NameBDBM50378854
Synonyms:IDRAPARINUX SODIUM
TypeSmall organic molecule
Emp. Form.C38H55O49S7
Mol. Mass.1520.274
SMILESCO[C@H]1O[C@H](COS([O-])(=O)=O)[C@@H](O[C@H]2O[C@H]([C@@H](O[C@H]3O[C@H](COS([O-])(=O)=O)[C@@H](O[C@@H]4O[C@@H]([C@@H](O[C@H]5O[C@H](COS([O-])(=O)=O)[C@@H](OC)[C@H](OC)[C@H]5OC)[C@H](OC)[C@H]4OC)C([O-])=O)[C@H](OS([O-])(=O)=O)[C@H]3OS([O-])(=O)=O)[C@H](OC)[C@H]2OC)C([O-])=O)[C@H](OS([O-])(=O)=O)[C@H]1OS([O-])(=O)=O