Reaction Details
TargetIsoform 4 of Lethal(3)malignant brain tumor-like protein 1 (4)
LigandBDBM50330499
Substrate/Competitorn/a
Meas. Tech.ChEMBL_684948 (CHEMBL1286363)
IC50 91000±n/a nM
Citation Kireev, DWigle, TJNorris-Drouin, JHerold, JMJanzen, WPFrye, SV Identification of non-peptide malignant brain tumor (MBT) repeat antagonists by virtual screening of commercially available compounds. J Med Chem53:7625-31 (2010) 
 
Isoform 4 of Lethal(3)malignant brain tumor-like protein 1 (4)
Name:Isoform 4 of Lethal(3)malignant brain tumor-like protein 1 (4)
Type:Protein
Mol. Mass.:83871.06
Organism:Homo sapiens (Human)
Description:Q9Y468-4
Residue:752
BDBM50330499
NameBDBM50330499
Synonyms:4-(2-benzylphenoxy)-N-methylbutan-1-amine | CHEMBL1192517
TypeSmall organic molecule
Emp. Form.C18H23NO
Mol. Mass.269.3813
SMILESCNCCCCOc1ccccc1Cc1ccccc1