Reaction Details
TargetCannabinoid receptor 1
LigandBDBM50330773
Substrate/Competitorn/a
Meas. Tech.ChEMBL_685389 (CHEMBL1287589)
Ki 1.2±n/a nM
Citation Huffman, JWHepburn, SALyutenko, NThompson, ALWiley, JLSelley, DEMartin, BR 1-Bromo-3-(1',1'-dimethylalkyl)-1-deoxy-¿(8)-tetrahydrocannabinols: New selective ligands for the cannabinoid CB(2) receptor. Bioorg Med Chem18:7809-15 (2010) 
 
Cannabinoid receptor 1
Name:Cannabinoid receptor 1
Type:G Protein-Coupled Receptor (GPCR)
Mol. Mass.:52868.96
Organism:Homo sapiens (Human)
Description:P21554
Residue:472
BDBM50330773
NameBDBM50330773
Synonyms:((6aR,10aR)-6,6-dimethyl-3-(2-methyloctan-2-yl)-6a,7,10,10a-tetrahydro-6H-benzo[c]chromen-9-yl)methanol JWH-051
TypeSmall organic molecule
Emp. Form.C25H38O2
Mol. Mass.370.568
SMILESCCCCCCC(C)(C)c1ccc2[C@@H]3CC(CO)=CC[C@H]3C(C)(C)Oc2c1