Reaction Details
TargetSialidase-3
LigandBDBM50331687
Substrate/Competitorn/a
Meas. Tech.ChEMBL_687674 (CHEMBL1291058)
IC50>500000±n/a nM
Citation Zou, YAlbohy, ASandbhor, MCairo, CW Inhibition of human neuraminidase 3 (NEU3) by C9-triazole derivatives of 2,3-didehydro-N-acetyl-neuraminic acid. Bioorg Med Chem Lett20:7529-33 (2010) 
 
Sialidase-3
Name:Sialidase-3
Type:PROTEIN
Mol. Mass.:48257.99
Organism:Homo sapiens (Human)
Description:ChEMBL_461856
Residue:428
BDBM50331687
NameBDBM50331687
Synonyms:(2R,3R,4S)-4-hydroxy-3-(2-(4-(phenoxymethyl)-1H-1,2,3-triazol-1-yl)acetamido)-2-((1R,2R)-1,2,3-trihydroxypropyl)-3,4-dihydro-2H-pyran-6-carboxylate | CHEMBL1290181
TypeSmall organic molecule
Emp. Form.C20H24N4O9
Mol. Mass.464.426
SMILESOC[C@@H](O)[C@@H](O)[C@@H]1OC(=C[C@H](O)[C@H]1NC(=O)Cn1cc(COc2ccccc2)nn1)C(O)=O