Reaction Details
TargetCarbonic anhydrase 2
LigandBDBM26980
Substrate/Competitorn/a
Meas. Tech.ChEMBL_700700 (CHEMBL1645739)
Ki 63000000±n/a nM
Citation Ekinci, DCeyhun, SBSentürk, MErdem, DKüfrevioglu, OISupuran, CT Characterization and anions inhibition studies of ana-carbonic anhydrase from the teleost fish Dicentrarchus labrax. Bioorg Med Chem19:744-8 (2011) 
 
Carbonic anhydrase 2
Name:Carbonic anhydrase 2
Type:Enzyme
Mol. Mass.:29250.71
Organism:Homo sapiens (Human)
Description:P00918
Residue:260
BDBM26980
NameBDBM26980
Synonyms:Br- CHEMBL1644694 bromide ion
TypeIon
Emp. Form.Br
Mol. Mass.79.905
SMILES[Br-]