Reaction Details
TargetCarbonic anhydrase 4
LigandBDBM26989
Substrate/Competitorn/a
Meas. Tech.ChEMBL_700701 (CHEMBL1645740)
Ki 30800000±n/a nM
Citation Ekinci, DCeyhun, SBSentürk, MErdem, DKüfrevioglu, OISupuran, CT Characterization and anions inhibition studies of ana-carbonic anhydrase from the teleost fish Dicentrarchus labrax. Bioorg Med Chem19:744-8 (2011) 
 
Carbonic anhydrase 4
Name:Carbonic anhydrase 4
Type:Enzyme
Mol. Mass.:35037.98
Organism:Homo sapiens (Human)
Description:P22748
Residue:312
BDBM26989
NameBDBM26989
Synonyms:CHEMBL93268 nitrite | nitrite ion
TypeIon
Emp. Form.NO2
Mol. Mass.46.006
SMILES[O-]N=O