Reaction Details
TargetCarbonic anhydrase 5A, mitochondrial
LigandBDBM26981
Substrate/Competitorn/a
Meas. Tech.ChEMBL_700697 (CHEMBL1645736)
Ki 25000000±n/a nM
Citation Ekinci, DCeyhun, SBSentürk, MErdem, DKüfrevioglu, OISupuran, CT Characterization and anions inhibition studies of ana-carbonic anhydrase from the teleost fish Dicentrarchus labrax. Bioorg Med Chem19:744-8 (2011) 
 
Carbonic anhydrase 5A, mitochondrial
Name:Carbonic anhydrase 5A, mitochondrial
Type:Enzyme
Mol. Mass.:34755.54
Organism:Homo sapiens (Human)
Description:Human (cloned) isozyme
Residue:305
BDBM26981
NameBDBM26981
Synonyms:CHEMBL1644695 POTASSIUM IODIDE iodide ion
TypeIon
Emp. Form.I
Mol. Mass.126.90502
SMILES[I-]