Reaction Details
TargetCarbonic anhydrase 5A, mitochondrial
LigandBDBM26992
Substrate/Competitorn/a
Meas. Tech.ChEMBL_700697 (CHEMBL1645736)
Ki 680000000±n/a nM
Citation Ekinci, DCeyhun, SBSentürk, MErdem, DKüfrevioglu, OISupuran, CT Characterization and anions inhibition studies of ana-carbonic anhydrase from the teleost fish Dicentrarchus labrax. Bioorg Med Chem19:744-8 (2011) 
 
Carbonic anhydrase 5A, mitochondrial
Name:Carbonic anhydrase 5A, mitochondrial
Type:Enzyme
Mol. Mass.:34755.54
Organism:Homo sapiens (Human)
Description:Human (cloned) isozyme
Residue:305
BDBM26992
NameBDBM26992
Synonyms:CHEMBL183495 SODIUM SULFATE sulfate ion
TypeIon
Emp. Form.O4S
Mol. Mass.96.064
SMILES[O-]S([O-])(=O)=O