Reaction Details
TargetCarbonic anhydrase 9
LigandBDBM26981
Substrate/Competitorn/a
Meas. Tech.ChEMBL_700696 (CHEMBL1645735)
Ki 7000000±n/a nM
Citation Ekinci, DCeyhun, SBSentürk, MErdem, DKüfrevioglu, OISupuran, CT Characterization and anions inhibition studies of ana-carbonic anhydrase from the teleost fish Dicentrarchus labrax. Bioorg Med Chem19:744-8 (2011) 
 
Carbonic anhydrase 9
Name:Carbonic anhydrase 9
Type:Enzyme
Mol. Mass.:49669.03
Organism:Homo sapiens (Human)
Description:Catalytic domain of human cloned isozyme was used in the assay
Residue:459
BDBM26981
NameBDBM26981
Synonyms:CHEMBL1644695 POTASSIUM IODIDE iodide ion
TypeIon
Emp. Form.I
Mol. Mass.126.90502
SMILES[I-]