Reaction Details
TargetTransient receptor potential cation channel subfamily V member 1
LigandBDBM50333933
Substrate/Competitorn/a
Meas. Tech.ChEMBL_700254 (CHEMBL1647472)
Ki 1.99±n/a nM
Citation Lim, KSKang, DWKim, YSKim, MSPark, SGChoi, SPearce, LVBlumberg, PMLee, J Receptor activity and conformational analysis of 5'-halogenated resiniferatoxin analogs as TRPV1 ligands. Bioorg Med Chem Lett21:299-302 (2010) 
 
Transient receptor potential cation channel subfamily V member 1
Name:Transient receptor potential cation channel subfamily V member 1
Type:Transient Receptor
Mol. Mass.:94956.12
Organism:Rattus norvegicus (rat)
Description:O35433
Residue:838
BDBM50333933
NameBDBM50333933
Synonyms:5-bromo-4-amino Resiniferatoxin | CHEMBL1644422
TypeSmall organic molecule
Emp. Form.C37H40BrNO8
Mol. Mass.706.619
SMILESCOc1cc(CC(=O)OCC2=C[C@H]3C4OC5(Cc6ccccc6)O[C@@]4(C[C@@H](C)C3(O5)[C@@H]3C=C(C)C(=O)[C@@]3(O)C2)C(C)=C)cc(Br)c1N