Reaction Details
TargetTransient receptor potential cation channel subfamily V member 1
LigandBDBM50333927
Substrate/Competitorn/a
Meas. Tech.ChEMBL_700256 (CHEMBL1647474)
Ki 7.2±n/a nM
Citation Lim, KSKang, DWKim, YSKim, MSPark, SGChoi, SPearce, LVBlumberg, PMLee, J Receptor activity and conformational analysis of 5'-halogenated resiniferatoxin analogs as TRPV1 ligands. Bioorg Med Chem Lett21:299-302 (2010) 
 
Transient receptor potential cation channel subfamily V member 1
Name:Transient receptor potential cation channel subfamily V member 1
Type:Transient Receptor
Mol. Mass.:94956.12
Organism:Rattus norvegicus (rat)
Description:O35433
Residue:838
BDBM50333927
NameBDBM50333927
Synonyms:CHEMBL1644416 | [(2R,6R,10S,15S,17R)-13-benzyl-6-hydroxy-4,17-dimethyl-5-oxo-15-(prop-1-en-2-yl)-12,14,18-trioxapentacyclo[11.4.1.0^{1,10}.0^{2,6}.0^{11,15}]octadeca-3,8-dien-8-yl]methyl 2-(3-bromo-4-hydroxy-5-methoxyphenyl)acetate
TypeSmall organic molecule
Emp. Form.C37H39BrO9
Mol. Mass.707.604
SMILESCOc1cc(CC(=O)OCC2=C[C@H]3C4OC5(Cc6ccccc6)O[C@@]4(C[C@@H](C)C3(O5)[C@@H]3C=C(C)C(=O)[C@@]3(O)C2)C(C)=C)cc(Br)c1O