Reaction Details
TargetFructose-1,6-bisphosphatase 1
LigandBDBM50335036
Substrate/Competitorn/a
Meas. Tech.ChEMBL_702737 (CHEMBL1657811)
IC50 12±n/a nM
Citation Fan, YJiang, TCashion, DKSun, ZTian, FDaRe, JLemus, R Discovery of a series of phosphonic acid-containing thiazoles and orally bioavailable diamide prodrugs that lower glucose in diabetic animals through inhibition of fructose-1,6-bisphosphatase. J Med Chem54:153-65 (2011) 
 
Fructose-1,6-bisphosphatase 1
Name:Fructose-1,6-bisphosphatase 1
Type:Protein
Mol. Mass.:36843.58
Organism:Homo sapiens (Human)
Description:Liver FBPase (P09467)
Residue:338
BDBM50335036
NameBDBM50335036
Synonyms:2-Amino-5-cyclobutyl-4-[2-(5-phosphono)furanyl]thiazole | CHEMBL1650181
TypeSmall organic molecule
Emp. Form.C12H17N2O4PS
Mol. Mass.316.313
SMILESCC(C)(C)Cc1sc(N)nc1-c1ccc(o1)P(O)(O)=O