Reaction Details
TargetFructose-1,6-bisphosphatase 1
LigandBDBM50335057
Substrate/Competitorn/a
Meas. Tech.ChEMBL_702737 (CHEMBL1657811)
IC50 14±n/a nM
Citation Fan, YJiang, TCashion, DKSun, ZTian, FDaRe, JLemus, R Discovery of a series of phosphonic acid-containing thiazoles and orally bioavailable diamide prodrugs that lower glucose in diabetic animals through inhibition of fructose-1,6-bisphosphatase. J Med Chem54:153-65 (2011) 
 
Fructose-1,6-bisphosphatase 1
Name:Fructose-1,6-bisphosphatase 1
Type:Protein
Mol. Mass.:36843.58
Organism:Homo sapiens (Human)
Description:Liver FBPase (P09467)
Residue:338
BDBM50335057
NameBDBM50335057
Synonyms:5-(2-amino-5-phenylthiazol-4-yl)furan-2-ylphosphonic acid | CHEMBL504104
TypeSmall organic molecule
Emp. Form.C13H11N2O4PS
Mol. Mass.322.276
SMILESNc1nc(-c2ccc(o2)P(O)(O)=O)c(s1)-c1ccccc1