Reaction Details
TargetFructose-1,6-bisphosphatase 1
LigandBDBM50335063
Substrate/Competitorn/a
Meas. Tech.ChEMBL_702737 (CHEMBL1657811)
IC50 14±n/a nM
Citation Fan, YJiang, TCashion, DKSun, ZTian, FDaRe, JLemus, R Discovery of a series of phosphonic acid-containing thiazoles and orally bioavailable diamide prodrugs that lower glucose in diabetic animals through inhibition of fructose-1,6-bisphosphatase. J Med Chem54:153-65 (2011) 
 
Fructose-1,6-bisphosphatase 1
Name:Fructose-1,6-bisphosphatase 1
Type:Protein
Mol. Mass.:36843.58
Organism:Homo sapiens (Human)
Description:Liver FBPase (P09467)
Residue:338
BDBM50335063
NameBDBM50335063
Synonyms:2-Amino-5-(4-methoxycarbonylphenyl)-4-[2-(5-phosphono)-furanyl]thiazole | CHEMBL1650203
TypeSmall organic molecule
Emp. Form.C15H13N2O6PS
Mol. Mass.380.312
SMILESCOC(=O)c1ccc(cc1)-c1sc(N)nc1-c1ccc(o1)P(O)(O)=O